{"text_format":"1","workbook":"xlsx","n_sheets":16,"sheets":["P5 full","Position Data","Times Data","P5 Boys Teams ","P5 Girls Teams","p5 b&g","p6 full","P6 Boys Teams","P6 Girls Teams","p6 b&g","p7 full","P7 Boys Teams","P7 Girls Teams","p7 b&g","s","S b&g"],"not_rendered":{"charts":0,"images":0,"macros":1,"external_links":0,"defined_names":9,"comments":0,"pivot_tables":0},"unopened":[],"bounds":{"document_bytes":16777216,"sheet_cells":100000,"rows_first":2000,"rows_last":500,"rows_between":2000,"halvings":0,"cell_chars":16384,"cell_head_chars":4096},"cells_cut":0,"cells_raw":0,"read":"whole","date_system":"1900"}

{"sheet":"P5 full","index":0,"n_rows":366,"n_cols":7,"rows_kept":366,"cut":false,"hidden":false,"merged":[]}
[]
["Race:","Garscube Harriers Schools Cross Country  Races P5"]
["Date:","2017-11-18"]
[]
["Pos","Barcode","Race Number","Name","Club/School","Time","Sex"]
["P0001",{"$f":"INDEX('Position Data'!$A$2:$A$500,(MATCH(A6,'Position Data'!$A$2:$A$500,0)-1),1)","v":{"$error":"#N/A"}},{"$f":"VLOOKUP($B6,#REF!,2,FALSE)","v":{"$error":"#N/A"}},{"$f":"VLOOKUP($B6,#REF!,3,FALSE)","v":{"$error":"#N/A"}},{"$f":"VLOOKUP($B6,#REF!,4,FALSE)","v":{"$error":"#N/A"}},{"$f":"OFFSET('Times Data'!D6,0,0)","v":"00:00:00"},{"$f":"VLOOKUP($B6,#REF!,5,FALSE)","v":{"$error":"#N/A"}}]
["P0002",{"$f":"INDEX('Position Data'!$A$2:$A$500,(MATCH(A7,'Position Data'!$A$2:$A$500,0)-1),1)","v":{"$error":"#N/A"}},{"$f":"VLOOKUP($B7,#REF!,2,FALSE)","v":{"$error":"#N/A"}},{"$f":"VLOOKUP($B7,#REF!,3,FALSE)","v":{"$error":"#N/A"}},{"$f":"VLOOKUP($B7,#REF!,4,FALSE)","v":{"$error":"#N/A"}},{"$f":"OFFSET('Times Data'!D7,0,0)","v":"00:00:00"},{"$f":"VLOOKUP($B7,#REF!,5,FALSE)","v":{"$error":"#N/A"}}]
["P0003",{"$f":"INDEX('Position Data'!$A$2:$A$500,(MATCH(A8,'Position Data'!$A$2:$A$500,0)-1),1)","v":{"$error":"#N/A"}},{"$f":"VLOOKUP($B8,#REF!,2,FALSE)","v":{"$error":"#N/A"}},{"$f":"VLOOKUP($B8,#REF!,3,FALSE)","v":{"$error":"#N/A"}},{"$f":"VLOOKUP($B8,#REF!,4,FALSE)","v":{"$error":"#N/A"}},{"$f":"OFFSET('Times Data'!D8,0,0)","v":"00:00:00"},{"$f":"VLOOKUP($B8,#REF!,5,FALSE)","v":{"$error":"#N/A"}}]
["P0004",{"$f":"INDEX('Position Data'!$A$2:$A$500,(MATCH(A9,'Position Data'!$A$2:$A$500,0)-1),1)","v":{"$error":"#N/A"}},{"$f":"VLOOKUP($B9,#REF!,2,FALSE)","v":{"$error":"#N/A"}},{"$f":"VLOOKUP($B9,#REF!,3,FALSE)","v":{"$error":"#N/A"}},{"$f":"VLOOKUP($B9,#REF!,4,FALSE)","v":{"$error":"#N/A"}},{"$f":"OFFSET('Times Data'!D9,0,0)","v":"00:00:00"},{"$f":"VLOOKUP($B9,#REF!,5,FALSE)","v":{"$error":"#N/A"}}]
["P0005",{"$f":"INDEX('Position Data'!$A$2:$A$500,(MATCH(A10,'Position Data'!$A$2:$A$500,0)-1),1)","v":{"$error":"#N/A"}},{"$f":"VLOOKUP($B10,#REF!,2,FALSE)","v":{"$error":"#N/A"}},{"$f":"VLOOKUP($B10,#REF!,3,FALSE)","v":{"$error":"#N/A"}},{"$f":"VLOOKUP($B10,#REF!,4,FALSE)","v":{"$error":"#N/A"}},{"$f":"OFFSET('Times Data'!D10,0,0)","v":"00:00:00"},{"$f":"VLOOKUP($B10,#REF!,5,FALSE)","v":{"$error":"#N/A"}}]
["P0006",{"$f":"INDEX('Position Data'!$A$2:$A$500,(MATCH(A11,'Position Data'!$A$2:$A$500,0)-1),1)","v":{"$error":"#N/A"}},{"$f":"VLOOKUP($B11,#REF!,2,FALSE)","v":{"$error":"#N/A"}},{"$f":"VLOOKUP($B11,#REF!,3,FALSE)","v":{"$error":"#N/A"}},{"$f":"VLOOKUP($B11,#REF!,4,FALSE)","v":{"$error":"#N/A"}},{"$f":"OFFSET('Times Data'!D11,0,0)","v":"00:00:00"},{"$f":"VLOOKUP($B11,#REF!,5,FALSE)","v":{"$error":"#N/A"}}]
["P0007",{"$f":"INDEX('Position Data'!$A$2:$A$500,(MATCH(A12,'Position Data'!$A$2:$A$500,0)-1),1)","v":{"$error":"#N/A"}},{"$f":"VLOOKUP($B12,#REF!,2,FALSE)","v":{"$error":"#N/A"}},{"$f":"VLOOKUP($B12,#REF!,3,FALSE)","v":{"$error":"#N/A"}},{"$f":"VLOOKUP($B12,#REF!,4,FALSE)","v":{"$error":"#N/A"}},{"$f":"OFFSET('Times Data'!D12,0,0)","v":"00:00:00"},{"$f":"VLOOKUP($B12,#REF!,5,FALSE)","v":{"$error":"#N/A"}}]
["P0008",{"$f":"INDEX('Position Data'!$A$2:$A$500,(MATCH(A13,'Position Data'!$A$2:$A$500,0)-1),1)","v":{"$error":"#N/A"}},{"$f":"VLOOKUP($B13,#REF!,2,FALSE)","v":{"$error":"#N/A"}},{"$f":"VLOOKUP($B13,#REF!,3,FALSE)","v":{"$error":"#N/A"}},{"$f":"VLOOKUP($B13,#REF!,4,FALSE)","v":{"$error":"#N/A"}},{"$f":"OFFSET('Times Data'!D13,0,0)","v":"00:00:00"},{"$f":"VLOOKUP($B13,#REF!,5,FALSE)","v":{"$error":"#N/A"}}]
["P0009",{"$f":"INDEX('Position Data'!$A$2:$A$500,(MATCH(A14,'Position Data'!$A$2:$A$500,0)-1),1)","v":{"$error":"#N/A"}},{"$f":"VLOOKUP($B14,#REF!,2,FALSE)","v":{"$error":"#N/A"}},{"$f":"VLOOKUP($B14,#REF!,3,FALSE)","v":{"$error":"#N/A"}},{"$f":"VLOOKUP($B14,#REF!,4,FALSE)","v":{"$error":"#N/A"}},{"$f":"OFFSET('Times Data'!D14,0,0)","v":"00:00:00"},{"$f":"VLOOKUP($B14,#REF!,5,FALSE)","v":{"$error":"#N/A"}}]
["P0010",{"$f":"INDEX('Position Data'!$A$2:$A$500,(MATCH(A15,'Position Data'!$A$2:$A$500,0)-1),1)","v":{"$error":"#N/A"}},{"$f":"VLOOKUP($B15,#REF!,2,FALSE)","v":{"$error":"#N/A"}},{"$f":"VLOOKUP($B15,#REF!,3,FALSE)","v":{"$error":"#N/A"}},{"$f":"VLOOKUP($B15,#REF!,4,FALSE)","v":{"$error":"#N/A"}},{"$f":"OFFSET('Times Data'!D15,0,0)","v":"00:00:00"},{"$f":"VLOOKUP($B15,#REF!,5,FALSE)","v":{"$error":"#N/A"}}]
{"$rows_left_out":352}
{"sheet":"Position Data","index":1,"n_rows":0,"n_cols":0,"rows_kept":0,"cut":false,"hidden":true,"merged":[]}

{"sheet":"Times Data","index":2,"n_rows":0,"n_cols":0,"rows_kept":0,"cut":false,"hidden":true,"merged":[]}

{"sheet":"P5 Boys Teams ","index":3,"n_rows":15,"n_cols":4,"rows_kept":15,"cut":false,"hidden":false,"merged":[]}
[null,"Name","School","Pos"]
["1st Team","Axel Anthony","Hillhead Primary",2]
[null,"Eithan Anthony","Hillhead Primary",3]
[null,"Max Vander Horst","Hillhead Primary",9]
[null,null,"Points",{"$f":"SUM(D2:D4)","v":14}]
[]
["2nd Team","Toby Goodier","Strathblane Primary",4]
[null,"Archie MacMillan","Strathblane Primary",6]
[null,"Sam Walne","Strathblane Primary",11]
[null,null,"Points",{"$f":"SUM(D7:D9)","v":21}]
[]
["3rd Team","Ethan Taylor","Bearsden Primary",5]
[null,"Jack McGeechan","Bearsden Primary",18]
[null,"Callum Cairns","Bearsden Primary",22]
[null,null,"Points",{"$f":"SUM(D12:D14)","v":45}]
{"$rows_left_out":1}
{"sheet":"P5 Girls Teams","index":4,"n_rows":15,"n_cols":4,"rows_kept":15,"cut":false,"hidden":false,"merged":[]}
[null,"Name","School","Pos"]
["1st Team","Nina Padmanabhan","Bearsden Primary",1]
[null,"Lilian Smith","Bearsden Primary",2]
[null,"Lucy Wilson","Bearsden Primary",7]
[null," ","Points",{"$f":"SUM(D2:D4)","v":10}]
[]
["2nd Team","Anna Steele","Merrylee Primary",4]
[null,"Lexie Speirs","Merrylee Primary",10]
[null,"Maisie Speirs","Merrylee Primary",14]
[null,null,"Points",{"$f":"SUM(D7:D9)","v":28}]
[]
["3rd Team ","Abbey Hennessey","Cardross Primary",5]
[null,"Emily Ferguson","Cardross Primary",11]
[null,"Cara Denny","Cardross Primary",20]
[null,null,"Points",{"$f":"SUM(D12:D14)","v":36}]
{"$rows_left_out":1}
{"sheet":"p5 b&g","index":5,"n_rows":43,"n_cols":15,"rows_kept":43,"cut":false,"hidden":false,"merged":[]}
["Pos","barcode","race no","Name","School","Time","Sex",null,"Pos","barcode","race no","Name","School","Time","Sex"]
[1,"A01041",102,"Rory Beaton","Mosshead Primary"," 00:09:31.440","m",null,1,"A01080",218,"Nina Padmanabhan","Bearsden Primary"," 00:09:48.000","f"]
[2,"A01055",113,"Axel Anthony","Hillhead Primary"," 00:09:38.540","m",null,2,"A01081",219,"Lilian Smith","Bearsden Primary"," 00:10:01.000","f"]
[3,"A01051",112,"Eithan Anthony","Hillhead Primary"," 00:09:41.760","m",null,3,"A01073",209,"Kiera Brogan","Strathblane Primary "," 00:10:11.000","f"]
[4,"A00974",17,"Toby Goodier","Strathblane Primary"," 00:09:44.440","m",null,4,"A01110",281,"Anna Steele","Merrylee Primary"," 00:10:12.000","f"]
[5,"A00938",43,"Ethan Taylor","Bearsden Primary"," 00:09:46.030","m",null,5,"A01158",238,"Abbey Hennessey","Cardross Primary"," 00:10:14.000","f"]
[6,"A00975",14,"Archie MacMillan","Strathblane Primary"," 00:09:47.000","m",null,6,"A01116",283,"Eilidh Thoms","glasgow gaelic school"," 00:10:16.000","f"]
[7,"A00924",61,"Robin Lumby","Meadowburn Primary"," 00:09:49.000","m",null,7,"A01087",222,"Lucy Wilson","Bearsden Primary"," 00:10:20.000","f"]
[8,"A01033",1,"Ruairidh Datta","Merrylee Primary"," 00:09:50.000","m",null,8,"A01150",245,"Calli Abel","Hillhead Primary"," 00:10:21.000","f"]
[9,"A00905",76,"Max Vander Horst","Hillhead Primary"," 00:09:51.000","m",null,9,"A01098",232,"Sophie Greaves","Meadowburn Primary"," 00:10:25.000","f"]
[10,"A01042",103,"Callum Mathew","Mosshead Primary"," 00:09:52.000","m",null,10,"A01121",274,"Lexie Speirs","Merrylee Primary"," 00:10:28.000","f"]
[11,"A00970",18,"Sam Walne","Strathblane Primary"," 00:09:53.000","m",null,11,"A01159",239,"Emily Ferguson","Cardross Primary"," 00:10:29.000","f"]
[12,"A01040",101,"Dillon Sim","Merrylee Primary"," 00:09:54.000","m",null,12,"A01074",211,"Erin Boyle","Balmuildy Primary"," 00:10:31.000","f"]
[13,"A00964",19,"Luca Marshall","Strathblane Primary"," 00:09:55.000","m",null,13,"A01117",282,"Niamh Scanlan","Hillhead Primary"," 00:10:32.000","f"]
[14,"A01043",104,"Struan Middleton","Killermont Primary"," 00:09:56.000","m",null,14,"A01122",273,"Maisie Speirs","Merrylee Primary"," 00:10:33.000","f"]
{"$rows_left_out":29}
{"sheet":"p6 full","index":6,"n_rows":51,"n_cols":14,"rows_kept":51,"cut":false,"hidden":false,"merged":[]}
["Pos","barcode","race number","Name","School","Time","Sex"]
[1,"A00897",84,"Finlay Adler","Hillhead Primary"," 00:08:55.670","m","non runners"]
[2,"A00934",50,"James Alexander","Bearsden Primary"," 00:08:55.830","m"]
[3,"A00902",79,"Alfie Millar","Hillhead Primary"," 00:09:05.610","m","A00966",21,"Kieran Breslin","Strathblane Primary",null,null,"m"]
[5,"A00904",77,"Finley Romans","Hillhead Primary"," 00:10:00.340","m","A00901",80,"Alfie Churches","Hillhead Primary",null,null,"m"]
[6,"A00910",71,"Jack Fleming","Cardross Primary"," 00:10:01.000","m","A00896",85,"Ari Lappin","Hillhead Primary",null,null,"m"]
[7,"A00903",78,"Johnny Gardiner","Hillhead Primary"," 00:10:02.000","m","A01067",201,"Ruby Erith","Lomond School",null,null,"f"]
[8,"A01149",246,"Ella Sharp","Hillhead Primary"," 00:10:03.000","f","A01148",247,"Neve Wilson","Hillhead Primary",null,null,"f"]
[9,"A00962",26,"Angus McCrory","Strathblane Primary"," 00:10:04.000","m"]
[10,"A00944",49,"Archie Orr","Bearsden Primary"," 00:10:05.000","m"]
[11,"A01058",119,"Andrew Muir","Holy Family Primary"," 00:10:06.000","m"]
[12,"A01052",114,"Lucas Pelaet-Pinder","Bearsden Primary"," 00:10:07.000","m"]
[13,"A00939",41,"Oscar Jamieson","Lomond School"," 00:10:08.000","m"]
[14,"A01095",234,"Niamh McKeown","Meadowburn Primary"," 00:10:09.000","f"]
[15,"A00891",90,"Jack O'Connor","Hillhead Primary"," 00:10:10.000","m"]
{"$rows_left_out":37}
{"sheet":"P6 Boys Teams","index":7,"n_rows":15,"n_cols":4,"rows_kept":15,"cut":false,"hidden":false,"merged":[]}
[null,"Name","School","Pos"]
["1st Team","Finlay Adler","Hillhead Primary",1]
[null,"Alfie Millar","Hillhead Primary",3]
[null,"Finley Romans","Hillhead Primary",5]
[null,null,"Points",{"$f":"SUM(D2:D4)","v":9}]
[]
["2nd Team","James Alexander","Bearsden Primary",2]
[null,"Archie Orr","Bearsden Primary",9]
[null,"Lucas Pelaet-Pinder","Bearsden Primary",11]
[null,null,"Points",{"$f":"SUM(D7:D9)","v":22}]
[]
["3rd Team","Hamish MacLean","Strathblane Primary",4]
[null,"Angus McCrory","Strathblane Primary",8]
[null,"Zack Ingram","Strathblane Primary",16]
[null,null,"Points",{"$f":"SUM(D12:D14)","v":28}]
{"$rows_left_out":1}
{"sheet":"P6 Girls Teams","index":8,"n_rows":15,"n_cols":4,"rows_kept":15,"cut":false,"hidden":false,"merged":[]}
[null,"Name","School","Pos"]
["1st Team","Abigail MacLaine ","Bearsden Primary",5]
[null,"Ellie MacCalman","Bearsden Primary",7]
[null,"Elspeth Scroop-Reid","Bearsden Primary",8]
[null,null,"Points",{"$f":"SUM(D2:D4)","v":20}]
[]
["2nd Team","Isla Rennie","Killermont Primary",9]
[null,"Isla Rae","Killermont Primary",15]
[null,"Anna Maclean","Killermont Primary",17]
[null,null,"Points",{"$f":"SUM(D7:D9)","v":41}]
[]
["3rd Team","Grace Lindsay","Bearsden Primary",10]
[null,"Georgia MacCalman","Bearsden Primary",12]
[null,"Eve Hardy","Bearsden Primary",19]
[null,null,"Points",{"$f":"SUM(D12:D14)","v":41}]
{"$rows_left_out":1}
{"sheet":"p6 b&g","index":9,"n_rows":30,"n_cols":15,"rows_kept":30,"cut":false,"hidden":false,"merged":[]}
["Pos","barcode","race no","Name","School","Time","Sex",null,"Pos","barcode","race no","Name","School","Time","Sex"]
[1,"A01149",246,"Ella Sharp","Hillhead Primary"," 00:10:03.000","f",null,1,"A00897",84,"Finlay Adler","Hillhead Primary"," 00:08:55.670","m"]
[2,"A01095",234,"Niamh McKeown","Meadowburn Primary"," 00:10:09.000","f",null,2,"A00934",50,"James Alexander","Bearsden Primary"," 00:08:55.830","m"]
[3,"A01077",214,"Aine Doherty","Milngavie Primary"," 00:10:11.000","f",null,3,"A00902",79,"Alfie Millar","Hillhead Primary"," 00:09:05.610","m"]
[4,"A01075",210,"Kirsten Campbell","Strathblane Primary"," 00:10:16.000","f",null,4,"A00959",24,"Hamish MacLean","Strathblane Primary"," 00:09:50.560","m"]
[5,"A01093",228,"Abigail MacLaine ","Bearsden Primary"," 00:10:18.000","f",null,5,"A00904",77,"Finley Romans","Hillhead Primary"," 00:10:00.340","m"]
[6,"A01157",237,"Molly Ferguson","Cardross Primary"," 00:10:22.000","f",null,6,"A00910",71,"Jack Fleming","Cardross Primary"," 00:10:01.000","m"]
[7,"A01090",225,"Ellie MacCalman","Bearsden Primary"," 00:10:23.000","f",null,7,"A00903",78,"Johnny Gardiner","Hillhead Primary"," 00:10:02.000","m"]
[8,"A01092",227,"Elspeth Scroop-Reid","Bearsden Primary"," 00:10:25.000","f",null,8,"A00962",26,"Angus McCrory","Strathblane Primary"," 00:10:04.000","m"]
[9,"A01068",204,"Isla Rennie","Killermont Primary"," 00:10:26.000","f",null,9,"A00944",49,"Archie Orr","Bearsden Primary"," 00:10:05.000","m"]
[10,"A01091",224,"Grace Lindsay","Bearsden Primary"," 00:10:27.000","f",null,10,"A01058",119,"Andrew Muir","Holy Family Primary"," 00:10:06.000","m"]
[11,"A01154",241,"Megan Querns","Cardross Primary"," 00:10:31.000","f",null,11,"A01052",114,"Lucas Pelaet-Pinder","Bearsden Primary"," 00:10:07.000","m"]
[12,"A01088",226,"Georgia MacCalman","Bearsden Primary"," 00:10:32.000","f",null,12,"A00939",41,"Oscar Jamieson","Lomond School"," 00:10:08.000","m"]
[13,"A01129",266,"Lauren Boyle","Notre Dame Primary"," 00:10:33.000","f",null,13,"A00891",90,"Jack O'Connor","Hillhead Primary"," 00:10:10.000","m"]
[14,"A01132",262,"Lorna Bateman","Notre Dame Primary"," 00:10:34.000","f",null,14,"A00930",51,"Alasdair Dalby","Bearsden Primary"," 00:10:12.000","m"]
{"$rows_left_out":16}
{"sheet":"p7 full","index":10,"n_rows":51,"n_cols":14,"rows_kept":51,"cut":false,"hidden":false,"merged":[]}
["Pos","barcode","race no","Name","School","Time","Sex"]
[1,"A00941",56,"Gregor Smith","Kirkintilloch Olympians"," 00:08:59.390","m"]
[2,"A00940",57,"Crawford Smith","Kirkintilloch Olympians"," 00:09:08.710","m"]
[3,"A01054",116," Calum Murray","Glasgow Gaelic School"," 00:09:12.210","m"]
[4,"A00885",98,"Fionn Leeson","St Charles Primary"," 00:09:18.960","m"]
[5,"A01037",4,"Lewis Rennie","Killermont Primary"," 00:09:23.020","m"]
[6,"A00892",89,"Liam Beck","Hillhead Primary"," 00:09:24.000","m"]
[7,"A01039",5,"Reece Hamilton","Killermont Primary"," 00:09:25.000","m"]
[8,"A01057",118,"Finn McDonald","Kelvindale Primary"," 00:09:26.000","m"]
[9,"A00948",39,"Ewan McCartney","Lomond School"," 00:09:27.000","m"]
[10,"A00937",55,"Ali Padmanabhan","Bearsden Primary"," 00:09:28.000","m","non runners"]
[11,"A00909",72,"Matthew Gall","Cardross Primary"," 00:09:29.000","m"]
[12,"A00956",38,"Rory Dunlop","Lomond School"," 00:09:30.000","m","A00960",28,"Lewis McLeod","Strathblane Primary",null,null,"m"]
[13,"A00943",37,"Oscar Deigton","Lomond School","00:09:31.000","m","A01066",202,"Ruby Bridges","Killermont Primary",null,null,"m"]
[14,"A00894",87,"Leon Benzie","Hillhead Primary"," 00:09:32.000","m","A01099",235,"Nina Scott","Meadowburn Primary",null,null,"m"]
{"$rows_left_out":37}
{"sheet":"P7 Boys Teams","index":11,"n_rows":15,"n_cols":4,"rows_kept":15,"cut":false,"hidden":false,"merged":[]}
[null,"Name","School","Pos"]
["1st Team","Lewis Rennie","Killermont Primary",5]
[null,"Reece Hamilton","Killermont Primary",7]
[null,"Euan Singer","Killermont Primary",15]
[null,null,"Points",{"$f":"SUM(D2:D4)","v":27}]
[]
["2nd Team","Ewan McCartney","Lomond School",9]
[null,"Rory Dunlop","Lomond School",12]
[null,"Oscar Deighan","Lomond School",13]
[null,null,"Points",{"$f":"SUM(D7:D9)","v":34}]
[]
["3rd Team","Liam Beck","Hillhead Primary",6]
[null,"Leon Benzie","Hillhead Primary",14]
[null,"Aedon Baddon","Hillhead Primary",23]
[null,null,"Points",{"$f":"SUM(D12:D14)","v":43}]
{"$rows_left_out":1}
{"sheet":"P7 Girls Teams","index":12,"n_rows":15,"n_cols":4,"rows_kept":15,"cut":false,"hidden":false,"merged":[]}
[null,"Name","School","Pos"]
["1st Team","Maddie Rooney","Cardross Primary",2]
[null,"Rowan Mair","Cardross Primary",4]
[null,"Eva Rooney","Cardross Primary",11]
[null,null,"Points",{"$f":"SUM(D2:D4)","v":17}]
[]
["2nd Team","Seona Brown","Glasgow Gaelic School",5]
[null,"Isla Thoms","glasgow gaelic school",6]
[null,"Korin Weir- Stewart","Glasgow Gaelic School",7]
[null,null,"Points",{"$f":"SUM(D7:D9)","v":18}]
[]
["3rd Team","Anastasia Vakaruk","Hillhead Primary",3]
[null,"Stella McCluskey","Hillhead Primary",15]
[null,"Megan Welsh","Hillhead Primary",16]
[null,null,"Points",{"$f":"SUM(D12:D14)","v":34}]
{"$rows_left_out":1}
{"sheet":"p7 b&g","index":13,"n_rows":28,"n_cols":15,"rows_kept":28,"cut":false,"hidden":false,"merged":[]}
["Pos","barcode","race no","Name","School","Time","Sex",null,"Pos","barcode","race no","Name","School","Time","Sex"]
[1,"A01079",215,"Jenna Gallacher","Lomond School"," 00:09:34.000","f",null,1,"A00941",56,"Gregor Smith","Kirkintilloch Olympians"," 00:08:59.390","m"]
[2,"A01152",243,"Maddie Rooney","Cardross Primary"," 00:09:39.000","f",null,2,"A00940",57,"Crawford Smith","Kirkintilloch Olympians"," 00:09:08.710","m"]
[3,"A01146",249,"Anastasia Vakaruk","Hillhead Primary"," 00:09:43.000","f",null,3,"A01054",116," Calum Murray","Glasgow Gaelic School"," 00:09:12.210","m"]
[4,"A01151",244,"Rowan Mair","Cardross Primary"," 00:09:44.000","f",null,4,"A00885",98,"Fionn Leeson","St Charles Primary"," 00:09:18.960","m"]
[5,"A01119",276,"Seona Brown","Glasgow Gaelic School"," 00:09:45.000","f",null,5,"A01037",4,"Lewis Rennie","Killermont Primary"," 00:09:23.020","m"]
[6,"A01112",284,"Isla Thoms","glasgow gaelic school"," 00:09:46.000","f",null,6,"A00892",89,"Liam Beck","Hillhead Primary"," 00:09:24.000","m"]
[7,"A02212",290,"Korin Weir- Stewart","Glasgow Gaelic School"," 00:09:47.000","f",null,7,"A01039",5,"Reece Hamilton","Killermont Primary"," 00:09:25.000","m"]
[8,"A01123",271,"Thea Kernohan","Milngavie Primary"," 00:09:49.000","f",null,8,"A01057",118,"Finn McDonald","Kelvindale Primary"," 00:09:26.000","m"]
[9,"A01096",230,"Emily Craig","Lenzie Meadow Primary"," 00:09:50.000","f",null,9,"A00948",39,"Ewan McCartney","Lomond School"," 00:09:27.000","m"]
[10,"A01115",277,"Cailyn Downey","Milngavie Primary"," 00:09:51.000","f",null,10,"A00937",55,"Ali Padmanabhan","Bearsden Primary"," 00:09:28.000","m"]
[11,"A01153",242,"Eva Rooney","Cardross Primary"," 00:09:54.000","f",null,11,"A00909",72,"Matthew Gall","Cardross Primary"," 00:09:29.000","m"]
[12,"A01133",263,"Maria McGilp","St Blanes"," 00:09:55.000","f",null,12,"A00956",38,"Rory Dunlop","Lomond School"," 00:09:30.000","m"]
[13,"A01134",261,"Darryl McCartney","Corpus Christi Primary"," 00:09:56.000","f",null,13,"A00943",37,"Oscar Deighan","Lomond School"," 00:09:31.000","m"]
[14,"A01156",236,"Brooke Paterson","Meadowburn Primary"," 00:09:57.000","f",null,14,"A00894",87,"Leon Benzie","Hillhead Primary"," 00:09:32.000","m"]
{"$rows_left_out":14}
{"sheet":"s","index":14,"n_rows":34,"n_cols":8,"rows_kept":34,"cut":false,"hidden":false,"merged":[]}
["Pos","barcode","race no","Name","School","year","Sex","Time"]
[1,"A01048",106,"Cameron Kemp","Lomond School","S6","m"," 00:07:52"]
[2,"A01062",123,"Aidan Tittmar","Glasgow Gaelic School","S4","m"," 00:08:34"]
[3,"A00946",42,"Alastair McCartney","Lomond School","S2","m"," 00:08:40"]
[4,"A00884",97,"Lewis Riddick","Cleveden","S3","m"," 00:08:59"]
[5,"A01109",287,"Kerry Gallacher","Balfron High School","S6","f"," 00:09:04"]
[6,"A00882",100,"Frazer Trearty","John Paul Academy","S4","m"," 00:09:19"]
[7,"A01060",121,"Connor Walker","Glasgow Gaelic School","S2","m"," 00:09:22"]
[8,"A02208",289,"Summer McDonald","Hyndland Secondary","S3","f"," 00:09:27"]
[9,"A02210",292,"Caoimne Quail","St Allouisius College","S3","f"," 00:09:37"]
[10,"A01063",124,"Isaac Birr","Glasgow Gaelic School","S1","m"," 00:09:39"]
[11,"A00890",91,"Jed Love","Sgoil Ghaidlig, Glasgow  ","S1","m"," 00:09:40"]
[12,"A01049",110,"Louis Sharp","Hillhead High","S1","m"," 00:09:43"]
[13,"A02213",291,"Roisin Coyle","St Allouisius College","S3","f"," 00:09:49"]
[14,"A01056",117,"Cameron O'Brien","Bearsden Academy","S1","m"," 00:10:02"]
{"$rows_left_out":20}
{"sheet":"S b&g","index":15,"n_rows":16,"n_cols":16,"rows_kept":16,"cut":false,"hidden":false,"merged":[]}
["Pos","barcode","race no","Name","School","year","Sex","Time","Pos","barcode","race no","Name","School","year","Sex","Time"]
[1,"A01109",287,"Kerry Gallacher","Balfron High School","S6","f"," 00:09:04",1,"A01048",106,"Cameron Kemp","Lomond School","S6","m"," 00:07:52"]
[2,"A02208",289,"Summer McDonald","Hyndland Secondary","S3","f"," 00:09:27",2,"A01062",123,"Aidan Tittmar","Glasgow Gaelic School","S4","m"," 00:08:34"]
[3,"A02210",292,"Caoimne Quail","St Allouisius College","S3","f"," 00:09:37",3,"A00946",42,"Alastair McCartney","Lomond School","S2","m"," 00:08:40"]
[4,"A02213",291,"Roisin Coyle","St Allouisius College","S3","f"," 00:09:49",4,"A00884",97,"Lewis Riddick","Cleveden Secondary","S3","m"," 00:08:59"]
[5,"A02209",288,"Caitlin Cameron Coyle","St Allouisius College","S4","f"," 00:10:42",5,"A00882",100,"Frazer Trearty","John Paul Academy","S4","m"," 00:09:19"]
[6,"A02211",293,"Peggy Nan Rodger","Glasgow Gaelic School","S2","f"," 00:10:48",6,"A01060",121,"Connor Walker","Glasgow Gaelic School","S2","m"," 00:09:22"]
[7,"A01108",286,"Cara Wotherspoon","unattached","S4","f"," 00:10:50",7,"A01063",124,"Isaac Birr","Glasgow Gaelic School","S1","m"," 00:09:39"]
[8,"A02215",295,"Abbey Mazl","Glasgow Gaelic School","S2","f"," 00:10:59",8,"A00890",91,"Jed Love","Sgoil Ghaidlig, Glasgow  ","S1","m"," 00:09:40"]
[9,"A01128",267,"Drew McCartney","St Thomas Aquinas","S3","f"," 00:11:18",9,"A01049",110,"Louis Sharp","Hillhead High School","S1","m"," 00:09:43"]
[10,"A01135",260,"Saskia Gorman","Hillhead High School","S1","f"," 00:11:29",10,"A01056",117,"Cameron O'Brien","Bearsden Academy","S1","m"," 00:10:02"]
[11,"A01111",280,"Erin Prior","John Paul Academy","S1","f"," 00:11:31",11,"A01059",120,"Cameron Weir","Glasgow Gaelic School","S1","m"," 00:10:07"]
[12,"A02214",294,"Kerry Stedart","Glasgow Gaelic School","S2","f"," 00:11:52",12,"A01061",122,"Hugh Borthwick","Boclair Academy","S1","m"," 00:10:16"]
[13,"A01131",264,"Lucy Willaims","Cleveden Secretary","S1","f"," 00:11:54"]
[14,"A01124",268,"Gillian Quinn","John Paul Academy","S6","f"," 00:12:57"]
{"$rows_left_out":1}